Error Memset Was Not Declared In This Scope


RECOMMENDED: If you have Windows errors then we strongly recommend that you download and run this (Windows) Repair Tool.

Oct 18, 2016. pngio.cc:222:39: error: 'memset' was not declared in this scope memset(&trans[0], 255, sizeof(trans)); make[3]: *** [pngio.lo] Error 1

RAD Game Tools’ web page. RAD makes Bink Video, the Miles Sound System, the Telemetry Performance Visualization System, Oodle Data Compression, and Granny.

error: ‘daq_params’ was not declared in this scope memset(&daq_params, 0, sizeof(daq_params)); ^ make[3]: ***.

src/XmlRpcSocket.cpp:114: error: 'memset' was not declared in this scope. src/XmlRpcSocket.cpp:151: error: 'memset' was not declared in this scope

Jan 25, 2012. error: 'memset' was not declared in this scope specmake: *** [ FormatterToHTML.o] Error 1 and 447.dealII with: quadrature.cc: In constructor.

On which Linux Gcc Error Was Not Declared In This Scope. declared-in-this-scope. Best Solution Of Memset. Not Declared In This Scope Cuda I.

Discover how to do serial communication from within your own applications from this detailed article.

Mar 29, 2015. 4.4.7, -O2, -DSPEC_CPU_LINUX, error: 'memset' was not declared in this scope. 4.4.7, -O2, -DSPEC_CPU_LINUX -include cstdlib -include.

1.1 What is OpenCOBOL? ¶ OpenCOBOL is an open-source COBOL compiler. OpenCOBOL implements a substantial part of the COBOL 85 and COBOL 2002 standards, as well as.

I am trying to compile my C program in Ubuntu 9.10 (gcc 4.4.1). I am getting this error: Rect.cpp:344: error: 'memset' was not declared in this scope But the.

[SOLVED] error: 'memset' in not declared in this scope – I'm trying to compile a package of OpenKiosk call NodeView on Ubuntu 10.04, I finally manage to run the 1rs. step of 3 with no problem at all, that I

Getting started with Arduino and a WS2811 or WS2812 LED strand using NEOPixel by AdaFruit or FastSPI_LED (FastLED).

FinishIPv6Address(uint8_t (&)[16], int, int)’: /home/ubuntu/build/tor-browser/security/pkix/lib/pkixnames.cpp:1701:32:.

MCSDK UG Chapter Exploring – Texas Instruments Wiki – Overview. The Multicore Software Development Kit (MCSDK) provides foundational software for TI KeyStone II device platforms. It encapsulates a collection of software.

Jun 2, 2012. 'virtual std::string Network::UdpSocket::_read_line_bin(int, unsigned int)': udpsocket.cc:68:29: error: 'memset' was not declared in this scope

I am trying to compile the complete example 8 provided at the end of this page: http://www.physics.wisc.edu/~craigm/idl/cmpfit.html but I am getting this error: error.

Infopath Smartcard Error I’ve finally switched to a real blog engine with my site – previously I used a homegrown.NET 2.0 solution with an InfoPath form to publish posts. Especially the latter was a little frustrating :-). It took me two days to get the new blog running. Infopath Smartcard Error. Photos Downloads

cpp:344: error: ‘ memset’ was not declared in this scope But the problem is I have already included in my cpp file:#include <stdio.h> #include <stdlib.h> And the same program compiles fine under Ubuntu 8.04 (gcc 4.2.4).Please.

lib/LoadShaders.cpp:27:42: error: 'fopen' was not declared in this scope./. was not declared in this scope make: *** [LoadShaders.o] Error 1. lib/vbm.cpp:106: 93: error: 'memset' was not declared in this scope make: *** [.

Unknown 13019 Error What do iPhone error messages mean? Of course, it depends on the iPhone error message in question. Each one means something different. For example, Error 13019 commonly occurs during attempts to sync voice. In addition, Apple Support indicates that the Genius feature of iTunes may cause unknown errors during syncing,

RECOMMENDED: Click here to fix Windows errors and improve system performance