Error Struts-tags Not Found

RECOMMENDED: If you have Windows errors then we strongly recommend that you download and run this (Windows) Repair Tool.

I am trying to get a struts 2 example to work but I am getting the following error when I try to run the code in Tomcat. HTTP Status 500 – /porject/index.jsp (line: 4.

Hi, I have configured all the steps given in tutorial, Everthing works fine. but in console i seeing warnings i.e, 1. WARNING: Could not find property [org.apache.

Hello all. This is actually my first post, and since I found no 'Intro forum'. But when I try to run it on my XAMPP, it always gives this error:. message / HelloWorldStruts2/index.jsp (line: 3, column: 40) File "/struts-tags" not found

Struts 2 File Upload Example. Struts2 multipart maxsize, FileUploadInterceptor, struts.multipart.maxSize, enctype multipart/form-data, allowedTypes

org.apache.jasper.JasperException: File "/struts-tags" not found org.apache.jasper.compiler.DefaultErrorHandler.jspError. Error: Servlet Jar not Loaded…

adding “the family has not found the funny side of this story for a long time now.” The doctor still treated Escudero “because she knew me and knew my situation was urgent,” but that the error needed to be fixed sooner rather than later.

Misconduct, Not Error, Found Behind Most Journal Retractions – Research misconduct, rather than error, is the leading cause of retractions in scientific. “Right now we’re incentivizing a lot of behavior that’s not actually constructive to science,” Dr. Fang said. Some hints have emerged on the size and.

I open the Library and click on a song to be told that the file cannot be found. I have to then go back to the music.

Daily Express Front Page Error Latest news, showbiz, sport, comment, lifestyle, city, video and pictures from the Daily Express and Sunday Express newspapers and Fascism had transformed Italy and Germany into “the best-governed nations in Europe”, the front-page clarion call enthused. when it struggled to compete. Daily Express 'EU boost to house prices' front

Oct 15, 2013. Moving the libraries from the WAR to the EAR may be very useful, e.g. if you have more than one WAR* inside one EAR, to avoid redundancy of.

Jun 14, 2011. You are mixing the Struts 1.3 tags with the Struts 2 tags. In order for your taglib declaration <%@ taglib prefix="s" uri="/struts-tags" %> to.

Barely a week after a two-word clerical error threatened to derail its $548 million parcel. board meeting two days later.

does anyone know why do we get the following exception in struts2 org.apache. jasper.JasperException: File "/struts-tags" not found.

Sep 25, 2012. I am trying to get a struts 2 example to work but I am getting the following error when I try to run the code in Tomcat. HTTP Status 500.

The man, whose name was not disclosed, died one hour and 45 minutes after the medication error, state investigators found. “The facility failed to have adequate policies in place to ensure medications were transcribed accurately and.

Kushner, President Trump’s son-in-law and senior adviser, did in fact list himself as a male in his New York voter.

I think you should look at other side, I mean, for a Java web application (Struts or not) you’ll need a host service that supports a Java Enterprise Application.

initially my jsp page is showed in proper way when i click on submit button it is showing class not found exception for sql library but then i add mysql library it is.

Hi, I am a newbie for Struts. I tried to follow the struts 2 hello world tutorial from apache doecument. "struts-tags" not found for Struts 2 RSS feed. Please show the exact error/stack trace and a JSP fragment that produces.

1304 Error Fanuc 0i / 0i Mate Alarm Codes for CNC machinists. Fanuc 0i Alarms Program errors (P/S alarm) Program errors /Alarms on program and operation (P/S alarm) 0 651 Error Windows 7 Oct 9, 2017. Hello guys, today in this article, I am going to share a solution for Error 651

Struts-tag ?. org.apache.jasper.JasperException: File "/struts-tags" not found In struts 2 distribution, I do not see struts-tags or its.tld. Am I missing it or why.

RECOMMENDED: Click here to fix Windows errors and improve system performance