Javac Createprocess Failed Error Code 2


[SOLVED]Notepad++ CreateProcess failed with error code 2 windows 7 64 bit

RECOMMENDED: If you have Windows errors then we strongly recommend that you download and run this (Windows) Repair Tool.

"javac": CreateProcess error=2. Please Help!. Java Forums on Bytes.

Sep 12, 2014. IOException: Cannot run program "C:hpLoadGeneratorbinmdrv.exe": CreateProcess error=2, The system cannot find the file specified at java.lang. I had to correctly debug the problem with BPM admin web console and I found that I was missing javac.exe which could be found in iava JDK. I installed it.

Error Singular Gradient In R Error Adding /etc/ssl/certs Sep 27 12:04:04 LSA3VLC1B collectd[10389]: NgNativeReader_NwLogCollector-FastUpdate: nwsdk failure: NwOpen returned 0; code 0; error: Could not find trusted session id in hello response. During installation I had this problem, in spite of adding GIT_SSL_NO_VERIFY=true before git submodule update line: Cloning into 'FFmpegLibrary/jni/fribidi'. error: server certificate verification failed.

With Ant >= 1.5, you can also use nested <compilerarg> elements with the <javac> task. How do I include a < character in my command-line arguments?

Javac Createprocess Failed With Error Code 2. Επιλέξτε τη γλώσσα σας. Κλείσιμο Μάθετε περισσότερα View this message in.

Aug 21, 2013. The scomp program can't find javac and fails with java.io.IOException on Windows!. The scomp fails with code too large error! General XMLBeans. on the path. java.io.IOException: CreateProcess: c:xmlbeans-1.0.2schemasjavac @c:DOCUME~1alexLOCALS~1Tempjavac20992 error=2 null java.io.

Internal Server Error In Idirect3ddevice 9 Google has confirmed the problems with their Drive app on Android, iPhone, and iPad. Some users have been reporting Google Drive is sending out internal server error 500 messages, and this is due to the official status page revealing. Half life crashing-internal drive error. it crashes at the loading screen

Java compile and run using notepad++ and nppexec – Stack Overflow – Java compile and run using notepad++ and nppexec. Ask Question. ===== READY ===== javac javac CreateProcess() failed with error code 2: The system.

Resolved Problems – Oracle – Resolved Problems. The following sections describe problems that have been resolved by Service Packs for WebLogic Server 6.1. Service Packs are cumulative; the.

2015年12月5日. 若想確認是否完成環境設置,可使用cmd 輸入javac,若跳出指令提示而非『找不到 指令』,代表環境配置已完成。 (豆知識:系統變數就是. (Exit code 1) new 1.exe CreateProcess() failed with error code 2: 系統找不到指定的檔案。 已確認cmd gcc gcc: fatal error: no input files compilation terminated. 回覆刪除. 回覆.

ant – CreateProcess error=206, The filename or. – I think one of the effective file paths are really long when java tries to compile clases. One worth try is to put codebase in a directory such as C:MyProject.

Relative Approximate Error Definition Relative error expresses how large the absolute error is compared with the total size of the object you are measuring. Relative error is expressed as fraction or is multiplied. Error Singular Gradient In R Error Adding /etc/ssl/certs Sep 27 12:04:04 LSA3VLC1B collectd[10389]: NgNativeReader_NwLogCollector-FastUpdate: nwsdk failure: NwOpen returned 0; code 0;

RECOMMENDED: Click here to fix Windows errors and improve system performance